Block a user
hermes-agent (0.21.2-thin3-20260912)
Published 2026-09-13 01:00:02 +00:00 by erik
Installation
docker pull gitea.technisite.ca/claude/hermes-agent:0.21.2-thin3-20260912sha256:6c879ba76235f5a659888d757aafff58f9364cabba0b3814dc319b84e7d77d59
Images
| Digest | OS / Arch | Size |
|---|---|---|
| 831743ce53 | linux/amd64 | 928 MiB |
Image Layers ( linux/amd64)
| # debian.sh --arch 'amd64' out/ 'trixie' '@1777939200' |
| ENV PYTHONUNBUFFERED=1 |
| ENV PYTHONDONTWRITEBYTECODE=1 |
| ENV PLAYWRIGHT_BROWSERS_PATH=/opt/hermes/.playwright |
| RUN /bin/sh -c apt-get -o Acquire::Retries=3 update && apt-get -o Acquire::Retries=3 install -y --no-install-recommends ca-certificates curl iputils-ping python3 python-is-python3 ripgrep ffmpeg gcc g++ make cmake python3-dev python3-venv libffi-dev libolm-dev libatomic1 procps git openssh-client docker-cli xz-utils && rm -rf /var/lib/apt/lists/* # buildkit |
| COPY /opt/sqlite-fixed/lib/libsqlite3.so.3.53.4 /usr/local/lib/ # buildkit |
| RUN /bin/sh -c ln -sf libsqlite3.so.3.53.4 /usr/local/lib/libsqlite3.so.0 && ln -sf libsqlite3.so.3.53.4 /usr/local/lib/libsqlite3.so && printf '/usr/local/lib\n' > /etc/ld.so.conf.d/000-sqlite-fixed.conf && ldconfig && python3 -c "import sqlite3, sys; v = sqlite3.sqlite_version_info; sys.exit(f'linked SQLite {sqlite3.sqlite_version} still has the WAL-reset bug') if v < (3, 51, 3) else None; db = sqlite3.connect(':memory:'); db.execute(\"CREATE VIRTUAL TABLE docs USING fts5(content, tokenize='trigram')\"); db.execute(\"INSERT INTO docs VALUES ('hermes')\"); sys.exit('SQLite FTS5 trigram self-test failed') if db.execute(\"SELECT count(*) FROM docs WHERE docs MATCH 'erm'\").fetchone()[0] != 1 else None; db.close()" # buildkit |
| ARG TARGETARCH=amd64 |
| ARG S6_OVERLAY_VERSION=3.2.3.0 |
| ARG S6_OVERLAY_NOARCH_SHA256=b720f9d9340efc8bb07528b9743813c836e4b02f8693d90241f047998b4c53cf |
| ARG S6_OVERLAY_X86_64_SHA256=a93f02882c6ed46b21e7adb5c0add86154f01236c93cd82c7d682722e8840563 |
| ARG S6_OVERLAY_AARCH64_SHA256=0952056ff913482163cc30e35b2e944b507ba1025d78f5becbb89367bf344581 |
| ARG S6_OVERLAY_SYMLINKS_SHA256=a60dc5235de3ecbcf874b9c1f18d73263ab99b289b9329aa950e8729c4789f0e |
| RUN |6 TARGETARCH=amd64 S6_OVERLAY_VERSION=3.2.3.0 S6_OVERLAY_NOARCH_SHA256=b720f9d9340efc8bb07528b9743813c836e4b02f8693d90241f047998b4c53cf S6_OVERLAY_X86_64_SHA256=a93f02882c6ed46b21e7adb5c0add86154f01236c93cd82c7d682722e8840563 S6_OVERLAY_AARCH64_SHA256=0952056ff913482163cc30e35b2e944b507ba1025d78f5becbb89367bf344581 S6_OVERLAY_SYMLINKS_SHA256=a60dc5235de3ecbcf874b9c1f18d73263ab99b289b9329aa950e8729c4789f0e /bin/sh -c set -eu; case "${TARGETARCH:-amd64}" in amd64) s6_arch="x86_64"; s6_arch_sha="${S6_OVERLAY_X86_64_SHA256}" ;; arm64) s6_arch="aarch64"; s6_arch_sha="${S6_OVERLAY_AARCH64_SHA256}" ;; *) echo "Unsupported TARGETARCH=${TARGETARCH} for s6-overlay" >&2; exit 1 ;; esac; base="https://github.com/just-containers/s6-overlay/releases/download/v${S6_OVERLAY_VERSION}"; curl -fsSL --retry 3 -o /tmp/s6-overlay-noarch.tar.xz "${base}/s6-overlay-noarch.tar.xz"; curl -fsSL --retry 3 -o /tmp/s6-overlay-symlinks-noarch.tar.xz "${base}/s6-overlay-symlinks-noarch.tar.xz"; curl -fsSL --retry 3 -o /tmp/s6-overlay-arch.tar.xz "${base}/s6-overlay-${s6_arch}.tar.xz"; { printf '%s %s\n' "${S6_OVERLAY_NOARCH_SHA256}" /tmp/s6-overlay-noarch.tar.xz; printf '%s %s\n' "${s6_arch_sha}" /tmp/s6-overlay-arch.tar.xz; printf '%s %s\n' "${S6_OVERLAY_SYMLINKS_SHA256}" /tmp/s6-overlay-symlinks-noarch.tar.xz; } > /tmp/s6-overlay.sha256; sha256sum -c /tmp/s6-overlay.sha256; tar -C / -Jxpf /tmp/s6-overlay-noarch.tar.xz; tar -C / -Jxpf /tmp/s6-overlay-arch.tar.xz; tar -C / -Jxpf /tmp/s6-overlay-symlinks-noarch.tar.xz; rm /tmp/s6-overlay-*.tar.xz /tmp/s6-overlay.sha256 # buildkit |
| COPY --chmod=0755 docker/tini-shim.sh /usr/bin/tini # buildkit |
| RUN |6 TARGETARCH=amd64 S6_OVERLAY_VERSION=3.2.3.0 S6_OVERLAY_NOARCH_SHA256=b720f9d9340efc8bb07528b9743813c836e4b02f8693d90241f047998b4c53cf S6_OVERLAY_X86_64_SHA256=a93f02882c6ed46b21e7adb5c0add86154f01236c93cd82c7d682722e8840563 S6_OVERLAY_AARCH64_SHA256=0952056ff913482163cc30e35b2e944b507ba1025d78f5becbb89367bf344581 S6_OVERLAY_SYMLINKS_SHA256=a60dc5235de3ecbcf874b9c1f18d73263ab99b289b9329aa950e8729c4789f0e /bin/sh -c useradd -u 10000 -m -d /opt/data hermes # buildkit |
| COPY --chmod=0755 /usr/local/bin/uv /usr/local/bin/uvx /usr/local/bin/ # buildkit |
| COPY --chmod=0755 /usr/local/bin/node /usr/local/bin/ # buildkit |
| COPY /usr/local/lib/node_modules/npm /usr/local/lib/node_modules/npm # buildkit |
| RUN |6 TARGETARCH=amd64 S6_OVERLAY_VERSION=3.2.3.0 S6_OVERLAY_NOARCH_SHA256=b720f9d9340efc8bb07528b9743813c836e4b02f8693d90241f047998b4c53cf S6_OVERLAY_X86_64_SHA256=a93f02882c6ed46b21e7adb5c0add86154f01236c93cd82c7d682722e8840563 S6_OVERLAY_AARCH64_SHA256=0952056ff913482163cc30e35b2e944b507ba1025d78f5becbb89367bf344581 S6_OVERLAY_SYMLINKS_SHA256=a60dc5235de3ecbcf874b9c1f18d73263ab99b289b9329aa950e8729c4789f0e /bin/sh -c ln -sf /usr/local/lib/node_modules/npm/bin/npm-cli.js /usr/local/bin/npm && ln -sf /usr/local/lib/node_modules/npm/bin/npx-cli.js /usr/local/bin/npx # buildkit |
| WORKDIR /opt/hermes |
| COPY package.json package-lock.json ./ # buildkit |
| COPY web/package.json web/ # buildkit |
| COPY ui-tui/package.json ui-tui/ # buildkit |
| COPY ui-tui/packages/hermes-ink/ ui-tui/packages/hermes-ink/ # buildkit |
| COPY apps/shared/ apps/shared/ # buildkit |
| ENV npm_config_install_links=false |
| RUN |6 TARGETARCH=amd64 S6_OVERLAY_VERSION=3.2.3.0 S6_OVERLAY_NOARCH_SHA256=b720f9d9340efc8bb07528b9743813c836e4b02f8693d90241f047998b4c53cf S6_OVERLAY_X86_64_SHA256=a93f02882c6ed46b21e7adb5c0add86154f01236c93cd82c7d682722e8840563 S6_OVERLAY_AARCH64_SHA256=0952056ff913482163cc30e35b2e944b507ba1025d78f5becbb89367bf344581 S6_OVERLAY_SYMLINKS_SHA256=a60dc5235de3ecbcf874b9c1f18d73263ab99b289b9329aa950e8729c4789f0e /bin/sh -c npm install --prefer-offline --no-audit --fetch-retries=5 && for i in 1 2 3; do npx playwright install --with-deps chromium --only-shell && break || { [ "$i" = 3 ] && exit 1; echo "playwright install failed (attempt $i); retrying in 10s"; sleep 10; }; done && npm cache clean --force # buildkit |
| COPY plugins/platforms/photon/sidecar/package.json plugins/platforms/photon/sidecar/package-lock.json plugins/platforms/photon/sidecar/patch-spectrum-mixed-attachments.mjs plugins/platforms/photon/sidecar/ # buildkit |
| RUN |6 TARGETARCH=amd64 S6_OVERLAY_VERSION=3.2.3.0 S6_OVERLAY_NOARCH_SHA256=b720f9d9340efc8bb07528b9743813c836e4b02f8693d90241f047998b4c53cf S6_OVERLAY_X86_64_SHA256=a93f02882c6ed46b21e7adb5c0add86154f01236c93cd82c7d682722e8840563 S6_OVERLAY_AARCH64_SHA256=0952056ff913482163cc30e35b2e944b507ba1025d78f5becbb89367bf344581 S6_OVERLAY_SYMLINKS_SHA256=a60dc5235de3ecbcf874b9c1f18d73263ab99b289b9329aa950e8729c4789f0e /bin/sh -c cd plugins/platforms/photon/sidecar && npm ci --no-audit --fetch-retries=5 && npm cache clean --force # buildkit |
| COPY pyproject.toml uv.lock ./ # buildkit |
| RUN |6 TARGETARCH=amd64 S6_OVERLAY_VERSION=3.2.3.0 S6_OVERLAY_NOARCH_SHA256=b720f9d9340efc8bb07528b9743813c836e4b02f8693d90241f047998b4c53cf S6_OVERLAY_X86_64_SHA256=a93f02882c6ed46b21e7adb5c0add86154f01236c93cd82c7d682722e8840563 S6_OVERLAY_AARCH64_SHA256=0952056ff913482163cc30e35b2e944b507ba1025d78f5becbb89367bf344581 S6_OVERLAY_SYMLINKS_SHA256=a60dc5235de3ecbcf874b9c1f18d73263ab99b289b9329aa950e8729c4789f0e /bin/sh -c touch ./README.md # buildkit |
| RUN |6 TARGETARCH=amd64 S6_OVERLAY_VERSION=3.2.3.0 S6_OVERLAY_NOARCH_SHA256=b720f9d9340efc8bb07528b9743813c836e4b02f8693d90241f047998b4c53cf S6_OVERLAY_X86_64_SHA256=a93f02882c6ed46b21e7adb5c0add86154f01236c93cd82c7d682722e8840563 S6_OVERLAY_AARCH64_SHA256=0952056ff913482163cc30e35b2e944b507ba1025d78f5becbb89367bf344581 S6_OVERLAY_SYMLINKS_SHA256=a60dc5235de3ecbcf874b9c1f18d73263ab99b289b9329aa950e8729c4789f0e /bin/sh -c uv sync --frozen --no-install-project --extra all --extra messaging --extra otlp --extra anthropic --extra bedrock --extra azure-identity --extra hindsight --extra matrix # buildkit |
| COPY web/ web/ # buildkit |
| COPY ui-tui/ ui-tui/ # buildkit |
| COPY apps/shared/ apps/shared/ # buildkit |
| RUN |6 TARGETARCH=amd64 S6_OVERLAY_VERSION=3.2.3.0 S6_OVERLAY_NOARCH_SHA256=b720f9d9340efc8bb07528b9743813c836e4b02f8693d90241f047998b4c53cf S6_OVERLAY_X86_64_SHA256=a93f02882c6ed46b21e7adb5c0add86154f01236c93cd82c7d682722e8840563 S6_OVERLAY_AARCH64_SHA256=0952056ff913482163cc30e35b2e944b507ba1025d78f5becbb89367bf344581 S6_OVERLAY_SYMLINKS_SHA256=a60dc5235de3ecbcf874b9c1f18d73263ab99b289b9329aa950e8729c4789f0e /bin/sh -c cd web && npm run build && cd ../ui-tui && npm run build # buildkit |
| COPY --chmod=a+rX,go-w . . # buildkit |
| RUN |6 TARGETARCH=amd64 S6_OVERLAY_VERSION=3.2.3.0 S6_OVERLAY_NOARCH_SHA256=b720f9d9340efc8bb07528b9743813c836e4b02f8693d90241f047998b4c53cf S6_OVERLAY_X86_64_SHA256=a93f02882c6ed46b21e7adb5c0add86154f01236c93cd82c7d682722e8840563 S6_OVERLAY_AARCH64_SHA256=0952056ff913482163cc30e35b2e944b507ba1025d78f5becbb89367bf344581 S6_OVERLAY_SYMLINKS_SHA256=a60dc5235de3ecbcf874b9c1f18d73263ab99b289b9329aa950e8729c4789f0e /bin/sh -c uv pip install --no-cache-dir --no-deps -e "." # buildkit |
| USER root |
| RUN |6 TARGETARCH=amd64 S6_OVERLAY_VERSION=3.2.3.0 S6_OVERLAY_NOARCH_SHA256=b720f9d9340efc8bb07528b9743813c836e4b02f8693d90241f047998b4c53cf S6_OVERLAY_X86_64_SHA256=a93f02882c6ed46b21e7adb5c0add86154f01236c93cd82c7d682722e8840563 S6_OVERLAY_AARCH64_SHA256=0952056ff913482163cc30e35b2e944b507ba1025d78f5becbb89367bf344581 S6_OVERLAY_SYMLINKS_SHA256=a60dc5235de3ecbcf874b9c1f18d73263ab99b289b9329aa950e8729c4789f0e /bin/sh -c mkdir -p /opt/hermes/bin && cp /opt/hermes/docker/hermes-exec-shim.sh /opt/hermes/bin/hermes && chmod 0755 /opt/hermes /opt/hermes/bin/hermes && printf 'docker\n' > /opt/hermes/.install_method # buildkit |
| ARG HERMES_GIT_SHA=939e45c91d751fadd94dcd1b873ac3cb44846213 |
| RUN |7 TARGETARCH=amd64 S6_OVERLAY_VERSION=3.2.3.0 S6_OVERLAY_NOARCH_SHA256=b720f9d9340efc8bb07528b9743813c836e4b02f8693d90241f047998b4c53cf S6_OVERLAY_X86_64_SHA256=a93f02882c6ed46b21e7adb5c0add86154f01236c93cd82c7d682722e8840563 S6_OVERLAY_AARCH64_SHA256=0952056ff913482163cc30e35b2e944b507ba1025d78f5becbb89367bf344581 S6_OVERLAY_SYMLINKS_SHA256=a60dc5235de3ecbcf874b9c1f18d73263ab99b289b9329aa950e8729c4789f0e HERMES_GIT_SHA=939e45c91d751fadd94dcd1b873ac3cb44846213 /bin/sh -c set -eu; if [ -n "${HERMES_GIT_SHA}" ]; then printf '%s\n' "${HERMES_GIT_SHA}" > /opt/hermes/.hermes_build_sha; fi; mkdir -p /etc/hermes; HERMES_GIT_SHA="${HERMES_GIT_SHA}" python3 -c 'import json, os, pathlib, tomllib; project = tomllib.loads(pathlib.Path("/opt/hermes/pyproject.toml").read_text(encoding="utf-8"))["project"]; marker = pathlib.Path("/etc/hermes/image-provenance.json"); marker.write_text(json.dumps({"schema": 1, "deployment_kind": "image", "manager": "docker", "image": "nousresearch/hermes-agent", "version": project["version"], "revision": os.environ.get("HERMES_GIT_SHA") or None}, sort_keys=True, separators=(",", ":")) + "\n", encoding="utf-8"); marker.chmod(0o444)' # buildkit |
| COPY docker/s6-rc.d/ /etc/s6-overlay/s6-rc.d/ # buildkit |
| RUN |7 TARGETARCH=amd64 S6_OVERLAY_VERSION=3.2.3.0 S6_OVERLAY_NOARCH_SHA256=b720f9d9340efc8bb07528b9743813c836e4b02f8693d90241f047998b4c53cf S6_OVERLAY_X86_64_SHA256=a93f02882c6ed46b21e7adb5c0add86154f01236c93cd82c7d682722e8840563 S6_OVERLAY_AARCH64_SHA256=0952056ff913482163cc30e35b2e944b507ba1025d78f5becbb89367bf344581 S6_OVERLAY_SYMLINKS_SHA256=a60dc5235de3ecbcf874b9c1f18d73263ab99b289b9329aa950e8729c4789f0e HERMES_GIT_SHA=939e45c91d751fadd94dcd1b873ac3cb44846213 /bin/sh -c mkdir -p /etc/cont-init.d && printf '#!/command/with-contenv sh\nexec /opt/hermes/docker/stage2-hook.sh\n' > /etc/cont-init.d/01-hermes-setup && chmod +x /etc/cont-init.d/01-hermes-setup # buildkit |
| COPY --chmod=0755 docker/cont-init.d/015-supervise-perms /etc/cont-init.d/015-supervise-perms # buildkit |
| COPY --chmod=0755 docker/cont-init.d/02-reconcile-profiles /etc/cont-init.d/02-reconcile-profiles # buildkit |
| ENV HERMES_WEB_DIST=/opt/hermes/hermes_cli/web_dist |
| ENV HERMES_TUI_DIR=/opt/hermes/ui-tui |
| ENV HERMES_HOME=/opt/data |
| ENV HERMES_WRITE_SAFE_ROOT=/opt/data |
| ENV HERMES_DISABLE_LAZY_INSTALLS=1 |
| ENV HERMES_LAZY_INSTALL_TARGET=/opt/data/lazy-packages |
| COPY --chmod=0755 docker/hermes-exec-shim.sh /opt/hermes/bin/hermes # buildkit |
| COPY --chmod=0755 docker/entrypoint-dispatch.sh /opt/hermes/docker/entrypoint-dispatch.sh # buildkit |
| ENV PATH=/opt/hermes/bin:/opt/hermes/.venv/bin:/opt/data/.local/bin:/usr/local/sbin:/usr/local/bin:/usr/sbin:/usr/bin:/sbin:/bin |
| RUN |7 TARGETARCH=amd64 S6_OVERLAY_VERSION=3.2.3.0 S6_OVERLAY_NOARCH_SHA256=b720f9d9340efc8bb07528b9743813c836e4b02f8693d90241f047998b4c53cf S6_OVERLAY_X86_64_SHA256=a93f02882c6ed46b21e7adb5c0add86154f01236c93cd82c7d682722e8840563 S6_OVERLAY_AARCH64_SHA256=0952056ff913482163cc30e35b2e944b507ba1025d78f5becbb89367bf344581 S6_OVERLAY_SYMLINKS_SHA256=a60dc5235de3ecbcf874b9c1f18d73263ab99b289b9329aa950e8729c4789f0e HERMES_GIT_SHA=939e45c91d751fadd94dcd1b873ac3cb44846213 /bin/sh -c mkdir -p /opt/data # buildkit |
| VOLUME [/opt/data] |
| ENTRYPOINT ["/opt/hermes/docker/entrypoint-dispatch.sh"] |
| CMD [] |
| COPY patches/ /tmp/technisite-patches/ # buildkit |
| RUN /bin/sh -c set -eu; cd /opt/hermes; n=0; for p in /tmp/technisite-patches/*.patch; do echo "applying $(basename "$p")"; git apply --verbose -p1 "$p"; n=$((n+1)); done; test "$n" -gt 0 || { echo "NO PATCHES APPLIED — refusing to build a bare relabel of upstream" >&2; exit 1; }; echo "applied $n patches"; rm -rf /tmp/technisite-patches # buildkit |
| COPY newfiles/ /opt/hermes/ # buildkit |
| COPY gitea-mcp /usr/local/bin/gitea-mcp # buildkit |
| COPY --chown=root:root searxng_server.py /opt/mcp-servers/searxng_server.py # buildkit |
| RUN /bin/sh -c /usr/bin/python3 -m venv /opt/mcp-servers/venv && /usr/local/bin/uv pip install --python /opt/mcp-servers/venv/bin/python3 mcp==1.26.0 requests # buildkit |
| ARG IMAGE_TAG=hermes-agent:0.21.2-thin3-20260912 |
| RUN |1 IMAGE_TAG=hermes-agent:0.21.2-thin3-20260912 /bin/sh -c set -eu; chmod 644 /opt/mcp-servers/searxng_server.py; chmod 755 /usr/local/bin/gitea-mcp; test -n "${IMAGE_TAG}" || { echo "IMAGE_TAG build-arg is required" >&2; exit 1; }; echo "${IMAGE_TAG}" > /etc/hermes-image-id # buildkit |
| RUN |1 IMAGE_TAG=hermes-agent:0.21.2-thin3-20260912 /bin/sh -c set -eu; for f in /etc/hermes-image-id; do test -e "$f" || { echo "CANARY FAILED (missing): $f" >&2; exit 1; }; done; for f in /opt/hermes/plugins/keeper-secrets/bind.py /opt/mcp-servers/venv/bin/python3 /usr/local/bin/gitea-mcp; do test -e "$f" || { echo "CANARY FAILED (missing): $f" >&2; exit 1; }; test -x "$f" || { echo "CANARY FAILED (not executable, $(stat -c %a "$f")): $f" >&2; exit 1; }; done; grep -q '/v1/session/yolo' /opt/hermes/gateway/platforms/api_server.py || { echo "CANARY FAILED: yolo endpoint absent" >&2; exit 1; }; grep -q '_PARKED_RETRY_MAX' /opt/hermes/tools/mcp_tool.py || { echo "CANARY FAILED: parked-probe backoff absent" >&2; exit 1; }; grep -q 'secrets.keeper' /opt/hermes/tools/lazy_deps.py || { echo "CANARY FAILED: Keeper lazy-dep registration absent" >&2; exit 1; }; for f in /opt/hermes/tools/nav_board_tools.py /opt/hermes/Dockerfile.golden2-derived; do test ! -e "$f" || { echo "INVERSE CANARY FAILED (retired patch is back): $f" >&2; exit 1; }; done; echo "canaries OK" # buildkit |
Labels
| Key | Value |
|---|---|
| org.opencontainers.image.revision | 939e45c91d751fadd94dcd1b873ac3cb44846213 |
Details
2026-09-13 01:00:02 +00:00
Versions (10)
View all
Container
5
OCI / Docker
0.21.5-thin4-20261001
2026-10-01
0.21.5-thin1-20260928
2026-09-29
0.21.5-thin2-20260929
2026-09-29
0.21.5-thin3-20260925
2026-09-25
0.21.5-thin2-20260925
2026-09-25